﻿person_id,report_id,survey_date,illness,illness_person,adult_miss_work,adult_miss_wk_days,adult_timeoff_paid,child_stay_home,child_miss_days,child_family_timeoff,child_family_timeoff_days,child_family_paid_timeoff,lon,lat
2289,4730435529,2020-11-23A00:00:00.000000+0000,0,,,,,,,,,,106.75674354817814,47.8806135932291
2300,9696681805,2020-11-23A00:00:00.000000+0000,0,,,,,,,,,,106.72885683354276,47.87342447697465
2311,5397004080,2020-11-23A00:00:00.000000+0000,0,,,,,,,,,,106.93441327118504,47.98133174985436
2322,8348012174,2020-11-23A00:00:00.000000+0000,1,хүүхэд,,,,1.0,3.0,0.0,,,106.94261308355703,47.99391685323443
2333,6009561657,2020-11-23A00:00:00.000000+0000,1,хүүхэд,,,,1.0,4.0,0.0,,,106.9342728695864,47.98316610325218
2344,7185292967,2020-11-23A00:00:00.000000+0000,1,хүүхэд,,,,1.0,11.0,0.0,,,106.94310942292806,47.99665921731119
2355,3953722018,2020-11-23A00:00:00.000000+0000,0,,,,,,,,,,106.93551773081406,47.99060449944808
2357,926552475,2020-11-23A00:00:00.000000+0000,1,хүүхэд,,,,0.0,,,,,106.9452444564759,47.99850249850401
2358,720509095,2020-11-23A00:00:00.000000+0000,1,насанд хүрсэн,,,,,,,,,106.93348776397792,47.98634531824111
2359,8827507794,2020-11-23A00:00:00.000000+0000,1,насанд хүрсэн,0.0,,,,,,,,106.93287112759027,47.98825292947522
2360,4850166658,2020-11-23A00:00:00.000000+0000,1,насанд хүрсэн,0.0,,,,,,,,106.94759696819608,47.99840407474942
2361,141876393,2020-11-23A00:00:00.000000+0000,0,,,,,,,,,,106.93623389659244,47.99435085024611
2362,4598069010,2020-11-23A00:00:00.000000+0000,1,хүүхэд,,,,0.0,,,,,106.9441998434525,47.99456707404389
2363,2056557759,2020-11-23A00:00:00.000000+0000,0,,,,,,,,,,106.93983397828524,47.99502158404501
2364,9770010608,2020-11-23A00:00:00.000000+0000,1,насанд хүрсэн,0.0,,,,,,,,106.93403263712644,47.97932867000766
2365,6053523455,2020-11-23A00:00:00.000000+0000,0,,,,,,,,,,106.93315373987993,47.99025808728264
2366,4129514704,2020-11-23A00:00:00.000000+0000,1,хүүхэд,,,,1.0,1.0,0.0,,,106.93403174226128,47.99059490761211
2367,3466502737,2020-11-23A00:00:00.000000+0000,0,,,,,,,,,,106.92841164229506,47.98094520906965
2368,8428066527,2020-11-23A00:00:00.000000+0000,1,насанд хүрсэн,0.0,,,,,,,,106.93814353802496,47.99132249817941
2369,9512044079,2020-11-23A00:00:00.000000+0000,0,,,,,,,,,,106.92853718264216,47.97861527571721
2370,1717989725,2020-11-23A00:00:00.000000+0000,1,насанд хүрсэн,1.0,3.0,0.0,,,,,,106.9471479732394,48.00061299200463
2371,5239521398,2020-11-23A00:00:00.000000+0000,1,насанд хүрсэн,1.0,2.0,0.0,,,,,,106.94500197286824,47.99899358746345
2372,4756170276,2020-11-23A00:00:00.000000+0000,1,насанд хүрсэн,0.0,,,,,,,,106.93913351381872,47.99134475592773
2373,6465705038,2020-11-23A00:00:00.000000+0000,0,,,,,,,,,,106.93832787198308,47.98854237827257
2374,2029270050,2020-11-23A00:00:00.000000+0000,1,насанд хүрсэн,0.0,,,,,,,,106.93374965724996,47.98282187874106
2375,9481672741,2020-11-23A00:00:00.000000+0000,1,хүүхэд,,,,0.0,,,,,106.93520041920746,47.980624614914205
2376,7834479273,2020-11-23A00:00:00.000000+0000,1,хүүхэд,,,,1.0,3.0,1.0,3.0,0.0,106.94038370117192,47.98919204985796
2377,1052598221,2020-11-23A00:00:00.000000+0000,0,,,,,,,,,,106.92590032229847,47.924863506152256
2378,3840953083,2020-11-23A00:00:00.000000+0000,0,,,,,,,,,,106.92514737217935,47.92718069938164
2379,9363858312,2020-11-23A00:00:00.000000+0000,1,насанд хүрсэн,0.0,,,,,,,,106.9257367311619,47.92780012841639
2380,2243309444,2020-11-23A00:00:00.000000+0000,1,насанд хүрсэн,0.0,,,,,,,,106.92585837769276,47.92700007527035
2381,631531573,2020-11-23A00:00:00.000000+0000,1,хүүхэд,0.0,,,,,,,,106.92613871586326,47.92483869022586
2382,3675592738,2020-11-23A00:00:00.000000+0000,1,хүүхэд,,,,1.0,5.0,0.0,,,106.9248715645896,47.92866928791207
2383,9458842565,2020-11-23A00:00:00.000000+0000,1,насанд хүрсэн,0.0,,,,,,,,106.92615035320745,47.92310852042728
2384,7995825923,2020-11-23A00:00:00.000000+0000,1,хүүхэд,,,,1.0,1.0,0.0,,,106.92951391024415,47.928758511048976
2385,2971194454,2020-11-23A00:00:00.000000+0000,1,насанд хүрсэн,1.0,1.0,0.0,,,,,,106.93082337307244,47.92511790483875
2386,297843237,2020-11-23A00:00:00.000000+0000,1,хүүхэд,,,,1.0,3.0,0.0,,,106.92658626844448,47.924212457401545
2387,6151953608,2020-11-23A00:00:00.000000+0000,0,,,,,,,,,,106.92941281144432,47.92976600230135
2388,5888467838,2020-11-23A00:00:00.000000+0000,1,хүүхэд,,,,0.0,,,,,106.92777110604403,47.92885880086854
2389,2440243335,2020-11-23A00:00:00.000000+0000,1,насанд хүрсэн,0.0,,,,,,,,106.93013397362265,47.92913942161321
2390,9984218539,2020-11-23A00:00:00.000000+0000,1,хүүхэд,,,,1.0,8.0,1.0,10.0,0.0,106.93132465619996,47.92721004898838
2391,654852049,2020-11-23A00:00:00.000000+0000,1,хүүхэд,,,,0.0,,,,,106.9275162183456,47.92935420038815
2392,2833812591,2020-11-23A00:00:00.000000+0000,0,,,,,,,,,,106.93023105906404,47.9290744194193
2393,5799922754,2020-11-23A00:00:00.000000+0000,0,,,,,,,,,,106.93136580698368,47.92518891226919
2394,2982847650,2020-11-23A00:00:00.000000+0000,0,,,,,,,,,,106.9306064451127,47.92619825245494
2395,4751499858,2020-11-23A00:00:00.000000+0000,1,насанд хүрсэн,0.0,,,,,,,,106.92407679648178,47.92723228147968
2396,3134957250,2020-11-23A00:00:00.000000+0000,1,хүүхэд,,,,1.0,5.0,1.0,5.0,0.0,106.93064648250342,47.926349567164834
2397,5564025476,2020-11-23A00:00:00.000000+0000,0,,,,,,,,,,106.9314089368356,47.925532454242926
2398,7998984859,2020-11-23A00:00:00.000000+0000,1,насанд хүрсэн,0.0,,,,,,,,106.92801221201876,47.9253914769525
2399,7598584447,2020-11-23A00:00:00.000000+0000,1,насанд хүрсэн,0.0,,,,,,,,106.92671287494936,47.92667704501692
2400,8947888687,2020-11-23A00:00:00.000000+0000,1,насанд хүрсэн,0.0,,,,,,,,106.92622552238716,47.927586994824544
2401,2459625873,2020-11-23A00:00:00.000000+0000,1,насанд хүрсэн,0.0,,,,,,,,106.93016196663292,47.92838543139651
2402,7542444303,2020-11-23A00:00:00.000000+0000,1,насанд хүрсэн,0.0,,,,,,,,106.9369296134685,47.88980661806085
2403,5670633136,2020-11-23A00:00:00.000000+0000,1,насанд хүрсэн,0.0,,,,,,,,106.92092003007131,47.88982874476695
2404,1387447185,2020-11-23A00:00:00.000000+0000,1,хүүхэд,,,,1.0,2.0,0.0,,,106.92749436512987,47.88823903518622
2405,1216224238,2020-11-23A00:00:00.000000+0000,0,,,,,,,,,,106.91710918128922,47.88933392163192
2406,5623555757,2020-11-23A00:00:00.000000+0000,1,хүүхэд,,,,1.0,10.0,1.0,7.0,0.0,106.919296437056,47.89427313431721
2407,2001367557,2020-11-23A00:00:00.000000+0000,0,,,,,,,,,,106.9213105068164,47.8933427648396
2409,3657131777,2020-11-23A00:00:00.000000+0000,1,насанд хүрсэн,0.0,,,,,,,,106.9266910925974,47.89281969715544
2410,9191281285,2020-11-23A00:00:00.000000+0000,1,насанд хүрсэн,1.0,7.0,1.0,,,,,,106.91667730627346,47.89527902616935
2411,329171890,2020-11-23A00:00:00.000000+0000,0,,,,,,,,,,106.92997204639752,47.893659077325246
2412,502086321,2020-11-23A00:00:00.000000+0000,1,хүүхэд,,,,1.0,1.0,1.0,2.0,1.0,106.92526180515615,47.888537658153545
2413,4968943949,2020-11-23A00:00:00.000000+0000,0,,,,,,,,,,106.93232218755304,47.894551330882045
2414,1268895267,2020-11-23A00:00:00.000000+0000,1,хүүхэд,,,,1.0,2.0,1.0,2.0,0.0,106.91771394513944,47.89322902868592
2415,214292520,2020-11-23A00:00:00.000000+0000,1,хүүхэд,1.0,,,1.0,5.0,1.0,3.0,0.0,106.92190375556676,47.89255312226018
2416,7451730222,2020-11-23A00:00:00.000000+0000,1,насанд хүрсэн,0.0,,,,,,,,106.9370307024126,47.88802213194314
2417,6655976361,2020-11-23A00:00:00.000000+0000,1,хүүхэд,,,,1.0,7.0,1.0,7.0,0.0,106.9181509592379,47.894532958375045
2418,8668447245,2020-11-23A00:00:00.000000+0000,1,хүүхэд,,,,1.0,1.0,1.0,2.0,0.0,106.92110565114189,47.89146247976629
2419,8892799436,2020-11-23A00:00:00.000000+0000,1,насанд хүрсэн,0.0,,,,,,,,106.93510734628136,47.89408044601088
2420,3108541235,2020-11-23A00:00:00.000000+0000,1,насанд хүрсэн,0.0,,,,,,,,106.91635529154571,47.89480074566672
2421,7134389546,2020-11-23A00:00:00.000000+0000,0,,,,,,,,,,106.9354602315168,47.89244880300316
2422,6260612437,2020-11-23A00:00:00.000000+0000,1,насанд хүрсэн,0.0,,,,,,,,106.92518046887255,47.88993168280764
2423,3561686489,2020-11-23A00:00:00.000000+0000,0,,,,,,,,,,106.91206035226168,47.8921825143152
2424,938373563,2020-11-23A00:00:00.000000+0000,1,насанд хүрсэн,0.0,,,,,,,,106.92399995162585,47.89236365958409
2425,1194843464,2020-11-23A00:00:00.000000+0000,1,насанд хүрсэн,,,,,,,,,106.93053061539467,47.89209266447138
2136,670035581,2020-11-23A00:00:00.000000+0000,1,хүүхэд,1.0,,,1.0,3.0,0.0,,,106.93221174123232,47.89369009446474
2137,9969185303,2020-11-23A00:00:00.000000+0000,0,,,,,,,,,,106.80655713871268,47.91556749170636
2138,4871997754,2020-11-23A00:00:00.000000+0000,0,,,,,,,,,,106.79986819588656,47.92375957424954
2139,4938983615,2020-11-23A00:00:00.000000+0000,1,хүүхэд,1.0,,,1.0,,0.0,,,106.80723332022468,47.92390965137732
2140,1386790947,2020-11-23A00:00:00.000000+0000,1,хүүхэд,0.0,,,0.0,,,,,106.90686966715931,47.92689509604404
2141,579889025,2020-11-23A00:00:00.000000+0000,1,хүүхэд,,,,1.0,3.0,0.0,,0.0,106.80069576083736,47.92171790181428
2142,1658253244,2020-11-23A00:00:00.000000+0000,1,насанд хүрсэн,0.0,1.0,0.0,1.0,3.0,1.0,1.0,1.0,106.8057218297394,47.91888481679672
2143,7144845597,2020-11-23A00:00:00.000000+0000,1,насанд хүрсэн,0.0,,,0.0,,,,,106.8011077551052,47.91515558584605
2144,2094559214,2020-11-23A00:00:00.000000+0000,1,,0.0,,,0.0,,,,,106.80548921941124,47.91563501453961
2145,8126242860,2020-11-23A00:00:00.000000+0000,1,хүүхэд,,,,0.0,,,,,106.79968910671953,47.92564537727825
2147,9080926849,2020-11-23A00:00:00.000000+0000,0,,,,,,,,,,106.80054839644411,47.9192508130727
2148,6035514230,2020-11-23A00:00:00.000000+0000,1,хүүхэд,,,,1.0,2.0,1.0,2.0,,106.79980335712526,47.91978994474351
2149,1512072334,2020-11-23A00:00:00.000000+0000,1,хүүхэд,0.0,,,0.0,,,,,106.804019308432,47.927882821639535
2150,512733967,2020-11-23A00:00:00.000000+0000,1,насанд хүрсэн,0.0,,,0.0,,,,,106.8054592027844,47.9158408850495
2151,122078257,2020-11-23A00:00:00.000000+0000,1,насанд хүрсэн,0.0,,,0.0,,,,,106.80525024414004,47.91723098505032
2152,11439778,2020-11-23A00:00:00.000000+0000,0,,,,,,,,,,106.80214225635665,47.92761833638865
2153,1762206570,2020-11-23A00:00:00.000000+0000,0,,,,,,,,,,106.80130622427562,47.91801569321146
2154,4346654776,2020-11-23A00:00:00.000000+0000,1,хүүхэд,,,,0.0,,,,,106.80215815608696,47.92173260121014
2155,6936650232,2020-11-23A00:00:00.000000+0000,0,,,,,,,,,,106.8046207651924,47.91885088710521
2156,2103039384,2020-11-23A00:00:00.000000+0000,0,,,,,,,,,,106.80605853533848,47.92586399348208
2158,883495564,2020-11-23A00:00:00.000000+0000,0,,,,,,,,,,106.79977440209304,47.92387012032808
2159,5109526654,2020-11-23A00:00:00.000000+0000,1,насанд хүрсэн,0.0,,,,,,,,106.79826063771569,47.92753458256715
2160,7061741087,2020-11-23A00:00:00.000000+0000,0,,,,,,,,,,106.80798206312322,47.923095931262615
2161,5496216433,2020-11-23A00:00:00.000000+0000,0,,,,,,,,,,106.80690937749736,47.91564748641294
2162,9688972707,2020-11-23A00:00:00.000000+0000,1,хүүхэд,,,,0.0,,,,,106.80339124315122,47.9269943585706
2163,2954646379,2020-11-23A00:00:00.000000+0000,0,,,,,,,,,,106.79946170519288,47.921689040795926
2164,7733162219,2020-11-23A00:00:00.000000+0000,0,,,,,,,,,,106.80369545890449,47.927616392722
2165,7387856847,2020-11-23A00:00:00.000000+0000,1,насанд хүрсэн,0.0,,,0.0,,,,,106.85263360495266,47.917303976162536
2166,1443385185,2020-11-23A00:00:00.000000+0000,0,,,,,,,,,,106.90288641413784,47.9368233930127
2167,1239615881,2020-11-23A00:00:00.000000+0000,1,хүүхэд,,,,1.0,2.0,0.0,2.0,,106.91393462297872,47.92636597975444
2169,5187022829,2020-11-23A00:00:00.000000+0000,1,насанд хүрсэн,0.0,,,0.0,,,,,106.89466476753338,47.93665626696109
2170,4563499117,2020-11-23A00:00:00.000000+0000,1,насанд хүрсэн,0.0,,,0.0,,,,,106.90361006932255,47.93591322314961
2171,8856496575,2020-11-23A00:00:00.000000+0000,1,хүүхэд,,,,1.0,5.0,,2.0,,106.90008064568173,47.94100908744525
2172,227730192,2020-11-23A00:00:00.000000+0000,1,насанд хүрсэн,0.0,,,0.0,,,,,106.89992844530516,47.941724340759706
2173,5757905456,2020-11-23A00:00:00.000000+0000,1,хүүхэд,,,,0.0,,,,,106.90465866804873,47.93777637046572
2174,2056832445,2020-11-23A00:00:00.000000+0000,0,,,,,,,,,,106.90182707877966,47.9371962059956
2175,3405535951,2020-11-23A00:00:00.000000+0000,0,,,,,,,,,,106.89270271359712,47.94064887277499
2176,8111310889,2020-11-23A00:00:00.000000+0000,0,,,,,,,,,,106.89662692537664,47.93843660441932
2177,6810927182,2020-11-23A00:00:00.000000+0000,0,,,,,,,,,,106.90523755361622,47.936392300553
2178,2681694738,2020-11-23A00:00:00.000000+0000,0,,,,,,,,,,106.89979858039888,47.93941631847839
2180,7800590314,2020-11-23A00:00:00.000000+0000,1,хүүхэд,,,,1.0,5.0,0.0,,,106.89592471148944,47.93689673794504
2181,1815217166,2020-11-23A00:00:00.000000+0000,0,,,,,,,,,,106.9027611717857,47.94001652740593
2182,6175349368,2020-11-23A00:00:00.000000+0000,1,хүүхэд,,,,1.0,2.0,0.0,,,106.9117797941041,47.9275093700269
2183,2034085053,2020-11-23A00:00:00.000000+0000,0,,,,,,,,,,106.90343891185351,47.938628218093136
2184,136076201,2020-11-23A00:00:00.000000+0000,0,,,,,,,,,,106.9075712863126,47.93735721450192
2185,6264313732,2020-11-23A00:00:00.000000+0000,1,хүүхэд,,,,1.0,3.0,0.0,,,106.89418928448082,47.94162786637949
2186,3561286540,2020-11-23A00:00:00.000000+0000,0,,,,,,,,,,106.89870503945323,47.94250815294586
2187,5556406642,2020-11-23A00:00:00.000000+0000,0,,,,,,,,,,106.895419947196,47.937847027480366
2188,2772538393,2020-11-23A00:00:00.000000+0000,1,хүүхэд,,,,0.0,,,,,106.89007318705092,47.94340638525991
2189,3082594084,2020-11-23A00:00:00.000000+0000,1,хүүхэд,,,,0.0,,,,,106.89324843037298,47.94215831980277
2191,8155056643,2020-11-23A00:00:00.000000+0000,0,,,,,,,,,,106.90430432249356,47.93563260349689
2192,8905157444,2020-11-23A00:00:00.000000+0000,1,насанд хүрсэн,0.0,,,0.0,,,,,106.90823084097076,47.9370812474757
2193,5252100293,2020-11-23A00:00:00.000000+0000,1,хүүхэд,,,,1.0,7.0,1.0,7.0,0.0,106.90327521959556,47.93690866840301
2194,6568455763,2020-11-23A00:00:00.000000+0000,1,насанд хүрсэн,0.0,,,0.0,,,,,106.90011704388284,47.937710198608606
2195,2203143342,2020-11-23A00:00:00.000000+0000,0,,,,,,,,,,106.90258379491463,47.936858630789146
2196,1137996067,2020-11-23A00:00:00.000000+0000,0,,,,,,,,,,106.90726259556013,47.92645394352362
2197,5556137352,2020-11-23A00:00:00.000000+0000,0,,,,,,,,,,106.9069839380913,47.925707374364656
2198,9373429894,2020-11-23A00:00:00.000000+0000,1,насанд хүрсэн,0.0,,,,,,,,106.90484633313623,47.92593628367872
2199,7765293237,2020-11-23A00:00:00.000000+0000,0,,,,,,,,,,106.908618215347,47.92796988969514
2200,5288934802,2020-11-23A00:00:00.000000+0000,1,насанд хүрсэн,0.0,,,,,,,,106.90572939049623,47.9276475466701
2202,7321878129,2020-11-23A00:00:00.000000+0000,0,,,,,,,,,,106.91028536283932,47.92809380895479
2203,4139174726,2020-11-23A00:00:00.000000+0000,1,насанд хүрсэн,0.0,,,,,,,,106.9123070656438,47.92647077096972
2204,5467657870,2020-11-23A00:00:00.000000+0000,0,,,,,,,,,,106.91208150088876,47.925894802536405
2205,8640005864,2020-11-23A00:00:00.000000+0000,0,,,,,,,,,,106.91115391577036,47.92815634607667
2206,6538297620,2020-11-23A00:00:00.000000+0000,0,,,,,,,,,,106.90692689352755,47.9275861511875
2207,8162016945,2020-11-23A00:00:00.000000+0000,1,хүүхэд,,,,1.0,2.0,0.0,,,106.9111641870507,47.92831102354079
2208,3173619111,2020-11-23A00:00:00.000000+0000,1,хүүхэд,,,,1.0,1.0,0.0,,,106.91093724361748,47.92676341780816
2209,7470150095,2020-11-23A00:00:00.000000+0000,1,насанд хүрсэн,0.0,,,0.0,,,,,106.91039960636353,47.92758502736672
2210,8231193515,2020-11-23A00:00:00.000000+0000,1,хүүхэд,,,,0.0,,,,,106.90925442133432,47.92668625153114
2211,2949572590,2020-11-23A00:00:00.000000+0000,1,хүүхэд,,,,1.0,5.0,1.0,3.0,,106.91409563682912,47.92716824411092
2213,4383463866,2020-11-23A00:00:00.000000+0000,1,хүүхэд,,,,0.0,,,,,106.90380605160586,47.927141439403925
2214,3096299552,2020-11-23A00:00:00.000000+0000,0,,,,,,,,,,106.91029618762543,47.926969283522034
2215,751260306,2020-11-23A00:00:00.000000+0000,0,,,,,,,,,,106.91210160035496,47.928013685456925
2216,1539761649,2020-11-23A00:00:00.000000+0000,0,,,,,,,,,,106.91140714626258,47.92707407617898
2217,6194848546,2020-11-23A00:00:00.000000+0000,0,,,,,,,,,,106.9111659812521,47.92605235254858
2218,9977115395,2020-11-23A00:00:00.000000+0000,0,,,,,,,,,,106.91408658562317,47.92592454266139
2219,1379475497,2020-11-23A00:00:00.000000+0000,0,,,,,,,,,,106.9083205898994,47.92786559638206
2220,4711452069,2020-11-23A00:00:00.000000+0000,1,хүүхэд,,,,1.0,1.0,0.0,,,106.854057929805,47.91511810968994
2221,6593266612,2020-11-23A00:00:00.000000+0000,0,,,,,,,,,,106.85197940579984,47.91677135372888
2222,5590169383,2020-11-23A00:00:00.000000+0000,0,,,,,,,,,,106.84940598089707,47.9149914066435
2224,463943787,2020-11-23A00:00:00.000000+0000,1,хүүхэд,,,,0.0,,,,,106.85067756950092,47.91333687736329
2225,127039013,2020-11-23A00:00:00.000000+0000,1,хүүхэд,,,,0.0,,,,,106.85002909825,47.91716516624983
2226,3056862784,2020-11-23A00:00:00.000000+0000,1,хүүхэд,,,,1.0,2.0,0.0,,,106.851992265608,47.915681797057616
2227,6445442339,2020-11-23A00:00:00.000000+0000,0,,,,,,,,,,106.8524654662698,47.917605752497465
2228,8485672556,2020-11-23A00:00:00.000000+0000,1,хүүхэд,,,,1.0,4.0,,,,106.85074860243792,47.9153500382192
2229,6256355194,2020-11-23A00:00:00.000000+0000,1,хүүхэд,,,,0.0,,,,,106.85168903197322,47.91372641103904
2230,9220737174,2020-11-23A00:00:00.000000+0000,1,хүүхэд,,,,1.0,1.0,0.0,,,106.8504921143942,47.9168824160633
2231,8748520522,2020-11-23A00:00:00.000000+0000,0,,,,,,,,,,106.85140879079832,47.91304777261665
2232,3551328405,2020-11-23A00:00:00.000000+0000,0,,,,,,,,,,106.85275391667793,47.91484174795382
2233,9847373023,2020-11-23A00:00:00.000000+0000,1,насанд хүрсэн,0.0,,,,,,,,106.85309796058948,47.91494822245753
2235,5813745277,2020-11-23A00:00:00.000000+0000,1,насанд хүрсэн,0.0,,,0.0,,,,,106.85404274212836,47.91662728978376
2236,2426027713,2020-11-23A00:00:00.000000+0000,1,хүүхэд,,,,0.0,,,,,106.85334262989454,47.9163227727592
2237,5162806134,2020-11-23A00:00:00.000000+0000,0,,,,,,,,,,106.85250892834824,47.91493296556518
2238,5427424494,2020-11-23A00:00:00.000000+0000,0,,,,,,,,,,106.8531170234928,47.91666121438825
2239,2748333753,2020-11-23A00:00:00.000000+0000,1,хүүхэд,,,,1.0,3.0,0.0,,,106.85419277281662,47.91326961643985
2240,6971122688,2020-11-23A00:00:00.000000+0000,0,,,,,,,,,,106.8516202922597,47.917689230099725
2241,2083596429,2020-11-23A00:00:00.000000+0000,0,,,,,,,,,,106.85189871674552,47.91628337670701
2242,2062062062,2020-11-23A00:00:00.000000+0000,0,,,,,,,,,,106.8511696543572,47.91351716639966
2243,8640856209,2020-11-23A00:00:00.000000+0000,0,,,,,,,,,,106.851504195988,47.915625134907685
2244,2601940625,2020-11-23A00:00:00.000000+0000,0,,,,,,,,,,106.85423169816424,47.91701782619182
2246,5869568028,2020-11-23A00:00:00.000000+0000,1,хүүхэд,0.0,,,0.0,,,,,106.84955813148392,47.91460847092039
2247,8886316663,2020-11-23A00:00:00.000000+0000,1,хүүхэд,,,,1.0,3.0,0.0,,,107.07084788940148,47.92491083614205
2248,5168702694,2020-11-23A00:00:00.000000+0000,1,хүүхэд,,,,1.0,2.0,0.0,,,107.07369993453304,47.91436591788309
2249,367134547,2020-11-23A00:00:00.000000+0000,1,насанд хүрсэн,,,,,,,,,107.05980960671094,47.91010854636093
2250,1354324775,2020-11-23A00:00:00.000000+0000,1,насанд хүрсэн,0.0,,0.0,1.0,2.0,1.0,1.0,0.0,107.08627411272,47.9320377776991
2251,3789943522,2020-11-23A00:00:00.000000+0000,1,насанд хүрсэн,1.0,2.0,,1.0,2.0,0.0,2.0,,107.01115427582106,47.91095457967264
2252,4447282391,2020-11-23A00:00:00.000000+0000,1,насанд хүрсэн,0.0,,0.0,0.0,,0.0,,,107.08791956237,47.93562017420961
2253,3178971171,2020-11-23A00:00:00.000000+0000,0,,,,,,,,,,107.01170450103596,47.90966532215963
2254,1911997415,2020-11-23A00:00:00.000000+0000,1,насанд хүрсэн,0.0,,,,,,,,107.0775924165907,47.91127791929479
2255,3058863884,2020-11-23A00:00:00.000000+0000,0,,,,,,,,,,107.0536870418944,47.91214451355536
2257,2961037910,2020-11-23A00:00:00.000000+0000,1,хүүхэд,,,,0.0,,,,,107.06039633011792,47.89897024297269
2258,2185708167,2020-11-23A00:00:00.000000+0000,1,насанд хүрсэн,0.0,,,,,,,,107.06152814786572,47.91627279466598
2259,9567473890,2020-11-23A00:00:00.000000+0000,1,насанд хүрсэн,0.0,,,,,,,,107.0630470019012,47.9305974811399
2260,141092471,2020-11-23A00:00:00.000000+0000,1,насанд хүрсэн,,,,,,,,,107.05603535205132,47.91059280092414
2261,729732434,2020-11-23A00:00:00.000000+0000,1,хүүхэд,,,,0.0,,,,,107.08284002218024,47.93318268739576
2262,4451965202,2020-11-23A00:00:00.000000+0000,1,насанд хүрсэн,,,,,,,,,107.0531367325448,47.931736407548726
2263,572140017,2020-11-23A00:00:00.000000+0000,1,хүүхэд,,,,,,,,,107.06170901510312,47.89768100842065
2264,6437811466,2020-11-23A00:00:00.000000+0000,1,насанд хүрсэн,,,,,,,,,107.0545189077287,47.93476941362083
2265,6158883738,2020-11-23A00:00:00.000000+0000,1,насанд хүрсэн,1.0,2.0,1.0,,,,,,107.05816333563024,47.90782035305351
2266,9291277686,2020-11-23A00:00:00.000000+0000,1,насанд хүрсэн,1.0,2.0,1.0,,,,,,107.06411437233707,47.91506117451524
2268,3317803114,2020-11-23A00:00:00.000000+0000,1,хүүхэд,,,,1.0,4.0,0.0,,,107.09858006885356,47.9279542671871
2269,8590585066,2020-11-23A00:00:00.000000+0000,1,хүүхэд,,,,1.0,2.0,,,,107.06614250525948,47.9117162843846
2270,6909640164,2020-11-23A00:00:00.000000+0000,1,насанд хүрсэн,1.0,1.0,,1.0,2.0,,,,107.05814287686084,47.93593761090352
2271,3630184039,2020-11-23A00:00:00.000000+0000,1,насанд хүрсэн,,,,,,,,,107.05211766813729,47.93387543251104
2272,9219244992,2020-11-23A00:00:00.000000+0000,1,насанд хүрсэн,,,,1.0,2.0,,,,107.05867153197391,47.92503000982357
2273,6485126221,2020-11-23A00:00:00.000000+0000,1,хүүхэд,,,,1.0,3.0,0.0,,,107.09462997961448,47.91857644249631
2274,2851292389,2020-11-23A00:00:00.000000+0000,1,хүүхэд,,,,,,,,,106.94281741349135,47.923909314303806
2275,1268776615,2020-11-23A00:00:00.000000+0000,1,хүүхэд,,,,1.0,3.0,1.0,2.0,0.0,106.9442747563438,47.92137882034562
2276,1297831210,2020-11-23A00:00:00.000000+0000,1,насанд хүрсэн,,,,0.0,,,,,106.94265928788806,47.92214652244584
2277,1569918877,2020-11-23A00:00:00.000000+0000,1,насанд хүрсэн,,,,0.0,,,,,106.94346255272424,47.92045679519658
2279,6240488762,2020-11-23A00:00:00.000000+0000,0,,,,,,,,,,106.94254644803164,47.92328954496711
2280,9605785904,2020-11-23A00:00:00.000000+0000,0,,,,,,,,,,106.943501528928,47.92202787888135
2281,5293279096,2020-11-23A00:00:00.000000+0000,1,насанд хүрсэн,,,,0.0,,,,,106.94208377272234,47.92502357808223
2283,8327665602,2020-11-23A00:00:00.000000+0000,1,насанд хүрсэн,,,,0.0,,,,,106.94313034911988,47.92145188805228
2284,9587283502,2020-11-23A00:00:00.000000+0000,1,хүүхэд,,,,0.0,,,,,106.94169915118106,47.926063020809
2285,5250761720,2020-11-23A00:00:00.000000+0000,1,хүүхэд,,,,0.0,,,,,106.94227707518615,47.92356188411507
2286,7410633717,2020-11-23A00:00:00.000000+0000,1,,,,,0.0,,,,,106.94368997547986,47.922763745246975
2287,935099730,2020-11-23A00:00:00.000000+0000,0,,,,,,,,,,106.94440740005165,47.92205311108764
2288,666193589,2020-11-23A00:00:00.000000+0000,1,,,,,1.0,10.0,1.0,,,106.94439574540544,47.92313339611018
2290,5302010029,2020-11-23A00:00:00.000000+0000,0,,,,,,,,,,106.94421992270227,47.92219270117454
2291,5215181655,2020-11-23A00:00:00.000000+0000,0,,,,,,,,,,106.94246139822106,47.92341136765091
2292,213254561,2020-11-23A00:00:00.000000+0000,1,насанд хүрсэн,,,,0.0,,,,,106.94270270879214,47.92430811265139
2293,9794356819,2020-11-23A00:00:00.000000+0000,1,насанд хүрсэн,,,,0.0,,,,,106.94393903246409,47.921431284788646
2294,64628847,2020-11-23A00:00:00.000000+0000,1,насанд хүрсэн,,,,0.0,,,,,106.94308625407464,47.9257171978594
2295,1541646329,2020-11-23A00:00:00.000000+0000,0,,,,,,,,,,106.94511585557004,47.9254873557647
2296,7950469229,2020-11-23A00:00:00.000000+0000,0,,,,,,,,,,106.94511985153292,47.92257204427815
2297,6131688389,2020-11-23A00:00:00.000000+0000,0,,,,,,,,,,106.94155297576256,47.92664838558836
2298,2797896971,2020-11-23A00:00:00.000000+0000,1,хүүхэд,,,,1.0,7.0,0.0,,,106.94391168021794,47.922213852446525
2299,5485120160,2020-11-23A00:00:00.000000+0000,1,насанд хүрсэн,,,,,,,,,106.942951625323,47.92056729574333
2301,1674759551,2020-11-23A00:00:00.000000+0000,1,насанд хүрсэн,,,,,,,,,106.94301083739894,47.92146693176824